Target
Receptor tyrosine-protein kinase erbB-2
Ligand
BDBM50214099
Substrate
Meas. Tech.
ChEMBL_456267 (CHEMBL888277)
IC50
1070±n/a nM
Citation
 Lin, RConnolly, PJLu, YChiu, GLi, SYu, YHuang, SLi, XEmanuel, SLMiddleton, SAGruninger, RHAdams, MFuentes-Pesquera, ARGreenberger, LM Synthesis and evaluation of pyrazolo[3,4-b]pyridine CDK1 inhibitors as anti-tumor agents. Bioorg Med Chem Lett 17:4297-302 (2007)  
Target
Name:
Receptor tyrosine-protein kinase erbB-2
Synonyms:
2.7.10.1 CD_antigen=CD340 ERBB2_HUMAN FASN/HER2 HER2 MLN19 NEU Proto-oncogene Neu Tyrosine kinase-type cell surface receptor HER2 | p185erbB2
Type:
Mol. Mass.:
137894.47
Organism:
Homo sapiens (Human)
Description:
P04626
Residue:
1255
  
Inhibitor
Name:
BDBM50214099
Synonyms:
CHEMBL400569 | N-((5-(3-(5-(4-methylpiperazin-1-yl)-1H-benzo[d]imidazol-2-yl)-1H-pyrazolo[3,4-b]pyridin-5-yl)pyridin-3-yl)methyl)ethanamine
Type:
Small organic molecule
Emp. Form.:
C26H29N9
Mol. Mass.:
467.5688
SMILES:
CCNCc1cncc(c1)-c1cnc2[nH]nc(-c3nc4ccc(cc4[nH]3)N3CCN(C)CC3)c2c1
: