Target
Cyclin-dependent kinase 1
Ligand
BDBM50214095
Substrate
Meas. Tech.
ChEMBL_456265 (CHEMBL888275)
IC50
0.7±n/a nM
Citation
 Lin, RConnolly, PJLu, YChiu, GLi, SYu, YHuang, SLi, XEmanuel, SLMiddleton, SAGruninger, RHAdams, MFuentes-Pesquera, ARGreenberger, LM Synthesis and evaluation of pyrazolo[3,4-b]pyridine CDK1 inhibitors as anti-tumor agents. Bioorg Med Chem Lett 17:4297-302 (2007)  
Target
Name:
Cyclin-dependent kinase 1
Synonyms:
CDC2 CDK1 CDKN1 Cell division protein kinase 1 P34CDC2 | p34 protein kinase
Type:
Enzyme Subunit
Mol. Mass.:
34101.08
Organism:
Homo sapiens (Human)
Description:
P06493
Residue:
297
  
Inhibitor
Name:
BDBM50214095
Synonyms:
CHEMBL248713 N-((5-(3-(5-fluoro-1H-benzo[d]imidazol-2-yl)-1H-pyrazolo[3,4-b]pyridin-5-yl)pyridin-3-yl)methyl)ethanamine
Type:
Small organic molecule
Emp. Form.:
C21H18FN7
Mol. Mass.:
387.4129
SMILES:
CCNCc1cncc(c1)-c1cnc2n[nH]c(-c3nc4ccc(F)cc4[nH]3)c2c1
: