Target
Proto-oncogene tyrosine-protein kinase receptor Ret
Ligand
BDBM50214109
Substrate
Meas. Tech.
ChEMBL_456269 (CHEMBL888279)
IC50
>100000±n/a nM
Citation
 Lin, RConnolly, PJLu, YChiu, GLi, SYu, YHuang, SLi, XEmanuel, SLMiddleton, SAGruninger, RHAdams, MFuentes-Pesquera, ARGreenberger, LM Synthesis and evaluation of pyrazolo[3,4-b]pyridine CDK1 inhibitors as anti-tumor agents. Bioorg Med Chem Lett 17:4297-302 (2007)  
Target
Name:
Proto-oncogene tyrosine-protein kinase receptor Ret
Synonyms:
CDHF12 Cadherin family member 12 Proto-oncogene c-Ret RET51 Tyrosine-protein kinase Ret (RET)
Type:
Protein
Mol. Mass.:
124318.29
Organism:
Homo sapiens (Human)
Description:
P07949
Residue:
1114
  
Inhibitor
Name:
BDBM50214109
Synonyms:
2-(5-(isoquinolin-4-yl)-1H-pyrazolo[3,4-b]pyridin-3-yl)-1H-benzo[d]imidazole-4-carboxylic acid | CHEMBL249501
Type:
Small organic molecule
Emp. Form.:
C23H14N6O2
Mol. Mass.:
406.3963
SMILES:
OC(=O)c1cccc2[nH]c(nc12)-c1[nH]nc2ncc(cc12)-c1cncc2ccccc12
: