Target
Cyclin-dependent kinase 1
Ligand
BDBM50214112
Substrate
Meas. Tech.
ChEMBL_456265 (CHEMBL888275)
IC50
1280±n/a nM
Citation
 Lin, RConnolly, PJLu, YChiu, GLi, SYu, YHuang, SLi, XEmanuel, SLMiddleton, SAGruninger, RHAdams, MFuentes-Pesquera, ARGreenberger, LM Synthesis and evaluation of pyrazolo[3,4-b]pyridine CDK1 inhibitors as anti-tumor agents. Bioorg Med Chem Lett 17:4297-302 (2007)  
Target
Name:
Cyclin-dependent kinase 1
Synonyms:
CDC2 CDK1 CDKN1 Cell division protein kinase 1 P34CDC2 | p34 protein kinase
Type:
Enzyme Subunit
Mol. Mass.:
34101.08
Organism:
Homo sapiens (Human)
Description:
P06493
Residue:
297
  
Inhibitor
Name:
BDBM50214112
Synonyms:
3-(4-(methoxymethyl)-1H-benzo[d]imidazol-2-yl)-5-(pyrimidin-5-yl)-1H-pyrazolo[3,4-b]pyridine | CHEMBL249302
Type:
Small organic molecule
Emp. Form.:
C19H15N7O
Mol. Mass.:
357.3687
SMILES:
COCc1cccc2nc([nH]c12)-c1[nH]nc2ncc(cc12)-c1cncnc1
: