Target
Vascular endothelial growth factor receptor 2
Ligand
BDBM50214109
Substrate
Meas. Tech.
ChEMBL_456266 (CHEMBL888276)
IC50
>10000±n/a nM
Citation
 Lin, RConnolly, PJLu, YChiu, GLi, SYu, YHuang, SLi, XEmanuel, SLMiddleton, SAGruninger, RHAdams, MFuentes-Pesquera, ARGreenberger, LM Synthesis and evaluation of pyrazolo[3,4-b]pyridine CDK1 inhibitors as anti-tumor agents. Bioorg Med Chem Lett 17:4297-302 (2007)  
Target
Name:
Vascular endothelial growth factor receptor 2
Synonyms:
CD_antigen=CD309 Fetal liver kinase 1 (FLK-1) KDR Protein-tyrosine kinase receptor Flk-1 VEGFR-2 VEGFR2 Vascular Endothelial Growth Factor Receptor Kinase 2 Vascular endothelial growth factor receptor 2 (KDR) Vascular endothelial growth factor receptor 2 (VEGFR2) Vascular endothelial growth factor receptor-2 (VEGFR-2)
Type:
Receptor Tyrosine Kinase
Mol. Mass.:
151510.97
Organism:
Homo sapiens (Human)
Description:
P35968
Residue:
1356
  
Inhibitor
Name:
BDBM50214109
Synonyms:
2-(5-(isoquinolin-4-yl)-1H-pyrazolo[3,4-b]pyridin-3-yl)-1H-benzo[d]imidazole-4-carboxylic acid | CHEMBL249501
Type:
Small organic molecule
Emp. Form.:
C23H14N6O2
Mol. Mass.:
406.3963
SMILES:
OC(=O)c1cccc2[nH]c(nc12)-c1[nH]nc2ncc(cc12)-c1cncc2ccccc12
: