Target
Beta-3 adrenergic receptor
Ligand
BDBM50214214
Substrate
Meas. Tech.
ChEMBL_456291 (CHEMBL888301)
Ki
1700±n/a nM
Citation
 Washburn, WNHarper, TWWu, GGodfrey, JDMcCann, PGirotra, RShao, CZhang, HGavai, AMikkilineni, ADejneka, TAhmed, SCaringal, YHangeland, JZhang, MCheng, PTRussell, ADSkwish, SSlusarchyk, DAAllen, GTFrohlich, BHAbboa-Offei, BECap, MWaldron, TLGeorge, RJTesfamariam, BDickinson, KESeymour, AASher, PM Arylpropanolamines: selective beta3 agonists arising from strategies to mitigate phase I metabolic transformations. Bioorg Med Chem Lett 17:4290-6 (2007)  
Target
Name:
Beta-3 adrenergic receptor
Synonyms:
ADRB3 ADRB3_HUMAN Beta-2 adrenergic receptor and beta-3 adrenergic receptor Beta-3 adrenoreceptor | adrenergic Beta3
Type:
G Protein-Coupled Receptor (GPCR)
Mol. Mass.:
43534.88
Organism:
Homo sapiens (Human)
Description:
Residue:
408
  
Inhibitor
Name:
BDBM50214214
Synonyms:
(R)-N-(3-(2-(bis(4-methoxyphenyl)methylamino)-1-hydroxyethyl)-2-fluoro-6-hydroxyphenyl)methanesulfonamide | CHEMBL251362
Type:
Small organic molecule
Emp. Form.:
C24H27FN2O6S
Mol. Mass.:
490.544
SMILES:
COc1ccc(cc1)C(NC[C@H](O)c1ccc(O)c(NS(C)(=O)=O)c1F)c1ccc(OC)cc1
: