Target
Beta-3 adrenergic receptor
Ligand
BDBM50214223
Substrate
Meas. Tech.
ChEMBL_456291 (CHEMBL888301)
Ki
31±n/a nM
Citation
 Washburn, WNHarper, TWWu, GGodfrey, JDMcCann, PGirotra, RShao, CZhang, HGavai, AMikkilineni, ADejneka, TAhmed, SCaringal, YHangeland, JZhang, MCheng, PTRussell, ADSkwish, SSlusarchyk, DAAllen, GTFrohlich, BHAbboa-Offei, BECap, MWaldron, TLGeorge, RJTesfamariam, BDickinson, KESeymour, AASher, PM Arylpropanolamines: selective beta3 agonists arising from strategies to mitigate phase I metabolic transformations. Bioorg Med Chem Lett 17:4290-6 (2007)  
Target
Name:
Beta-3 adrenergic receptor
Synonyms:
ADRB3 ADRB3_HUMAN Beta-2 adrenergic receptor and beta-3 adrenergic receptor Beta-3 adrenoreceptor | adrenergic Beta3
Type:
G Protein-Coupled Receptor (GPCR)
Mol. Mass.:
43534.88
Organism:
Homo sapiens (Human)
Description:
Residue:
408
  
Inhibitor
Name:
BDBM50214223
Synonyms:
CHEMBL251347 | N-(2-hydroxy-5-((R)-2-hydroxy-3-((S)-1-(4-methoxyphenyl)-3-phenylpropylamino)propyl)phenyl)methanesulfonamide
Type:
Small organic molecule
Emp. Form.:
C26H32N2O5S
Mol. Mass.:
484.608
SMILES:
COc1ccc(cc1)[C@H](CCc1ccccc1)NC[C@H](O)Cc1ccc(O)c(NS(C)(=O)=O)c1
: