Target
Casein kinase II subunit alpha
Ligand
BDBM50214452
Substrate
Meas. Tech.
ChEMBL_439082 (CHEMBL889430)
Ki
24±n/a nM
Citation
 Nie, ZPerretta, CErickson, PMargosiak, SAlmassy, RLu, JAverill, AYager, KMChu, S Structure-based design, synthesis, and study of pyrazolo[1,5-a][1,3,5]triazine derivatives as potent inhibitors of protein kinase CK2. Bioorg Med Chem Lett 17:4191-5 (2007)  
Target
Name:
Casein kinase II subunit alpha
Synonyms:
CK II CK2- alpha CSK21_HUMAN Casein kinase 2 Casein kinase II alpha/beta Casein kinase II subunit alpha (CK2A1) Casein kinase II subunit alpha (CK2a V66A) Casein kinase II subunit alpha (CK2a)
Type:
Enzyme
Mol. Mass.:
45151.12
Organism:
Homo sapiens (Human)
Description:
P68400
Residue:
391
  
Inhibitor
Name:
BDBM50214452
Synonyms:
2-(4-ETHYLPIPERAZIN-1-YL)-4-(PHENYLAMINO)PYRAZOLO[1,5-A][1,3,5]TRIAZINE-8-CARBONITRILE | CHEMBL230137
Type:
Small organic molecule
Emp. Form.:
C18H20N8
Mol. Mass.:
348.405
SMILES:
CCN1CCN(CC1)c1nc(Nc2ccccc2)n2ncc(C#N)c2n1
: