Target
Casein kinase II subunit alpha
Ligand
BDBM50214465
Substrate
Meas. Tech.
ChEMBL_439082 (CHEMBL889430)
Ki
5±n/a nM
Citation
 Nie, ZPerretta, CErickson, PMargosiak, SAlmassy, RLu, JAverill, AYager, KMChu, S Structure-based design, synthesis, and study of pyrazolo[1,5-a][1,3,5]triazine derivatives as potent inhibitors of protein kinase CK2. Bioorg Med Chem Lett 17:4191-5 (2007)  
Target
Name:
Casein kinase II subunit alpha
Synonyms:
CK II CK2- alpha CSK21_HUMAN Casein kinase 2 Casein kinase II alpha/beta Casein kinase II subunit alpha (CK2A1) Casein kinase II subunit alpha (CK2a V66A) Casein kinase II subunit alpha (CK2a)
Type:
Enzyme
Mol. Mass.:
45151.12
Organism:
Homo sapiens (Human)
Description:
P68400
Residue:
391
  
Inhibitor
Name:
BDBM50214465
Synonyms:
2-(4-chlorobenzylamino)-4-(phenylamino)pyrazolo[1,5-a][1,3,5]triazine-8-carbonitrile | CHEMBL230347
Type:
Small organic molecule
Emp. Form.:
C19H14ClN7
Mol. Mass.:
375.814
SMILES:
Clc1ccc(CNc2nc(Nc3ccccc3)n3ncc(C#N)c3n2)cc1
: