Target
Gamma-aminobutyric acid receptor subunit alpha-2/beta-2/gamma-2
Ligand
BDBM50214662
Substrate
Meas. Tech.
ChEMBL_448069 (CHEMBL898324)
Ki
1060±n/a nM
Citation
 Alam, MSHuang, JOzoe, FMatsumura, FOzoe, Y Synthesis, 3D-QSAR, and docking studies of 1-phenyl-1H-1,2,3-triazoles as selective antagonists for beta3 over alpha1beta2gamma2 GABA receptors. Bioorg Med Chem 15:5090-104 (2007)  
Target
Name:
Gamma-aminobutyric acid receptor subunit alpha-2/beta-2/gamma-2
Synonyms:
GABA A receptor alpha-2/beta-2/gamma-2 | GABA receptor alpha-2/beta-2/gamma-2 subunit
Type:
Mol. Mass.:
Description:
ASSAY_ID of EBI is 69647
Components:
This complex has 3 components.
Component 1
Name:
Gamma-aminobutyric acid receptor subunit gamma-2
Synonyms:
GABA(A) receptor subunit gamma-2 GBRG2_HUMAN
Type:
PROTEIN
Mol. Mass.:
54172.74
Organism:
Homo sapiens (Human)
Description:
EBI_217
Residue:
467
  
Component 2
Name:
Gamma-aminobutyric acid receptor subunit beta-2
Synonyms:
GABA(A) receptor subunit beta-2 GBRB2_HUMAN
Type:
PROTEIN
Mol. Mass.:
59167.91
Organism:
Homo sapiens (Human)
Description:
EBI_221
Residue:
512
  
Component 3
Name:
Gamma-aminobutyric acid receptor subunit alpha-2
Synonyms:
GABA receptor alpha-2 subunit GBRA2_HUMAN | Gamma-aminobutyric acid receptor subunit alpha-2 (GABRA2)
Type:
Protein
Mol. Mass.:
51338.78
Organism:
Homo sapiens (Human)
Description:
P47869
Residue:
451
  
Component 4
Name:
Gamma-aminobutyric acid receptor subunit beta-2
Synonyms:
GABA(A) receptor subunit beta-2 GBRB2_HUMAN
Type:
PROTEIN
Mol. Mass.:
59167.91
Organism:
Homo sapiens (Human)
Description:
EBI_221
Residue:
512
  
Inhibitor
Name:
BDBM50214662
Synonyms:
1-(2,6-dichloro-4-trifluoromethylphenyl)-4-ethyl-5-methyl-1H-1,2,3-triazole | CHEMBL392035
Type:
Small organic molecule
Emp. Form.:
C12H10Cl2F3N3
Mol. Mass.:
324.129
SMILES:
CCc1nnn(c1C)-c1c(Cl)cc(cc1Cl)C(F)(F)F
: