Target
Peroxisome proliferator-activated receptor alpha
Ligand
BDBM50214908
Substrate
Meas. Tech.
ChEMBL_456357 (CHEMBL888368)
EC50
190±n/a nM
Citation
 Yamazaki, YAbe, KToma, TNishikawa, MOzawa, HOkuda, AAraki, TOda, SInoue, KShibuya, KStaels, BFruchart, JC Design and synthesis of highly potent and selective human peroxisome proliferator-activated receptor alpha agonists. Bioorg Med Chem Lett 17:4689-93 (2007)  
Target
Name:
Peroxisome proliferator-activated receptor alpha
Synonyms:
NR1C1 PPAR PPAR-alpha PPARA_HUMAN Peroxisome proliferator-activated receptor | Peroxisome proliferator-activated receptor alpha (PPAR alpha)
Type:
Enzyme
Mol. Mass.:
52222.08
Organism:
Homo sapiens (Human)
Description:
Q07869
Residue:
468
  
Inhibitor
Name:
BDBM50214908
Synonyms:
2-(3-((benzo[d]oxazol-2-yl(3-phenoxypropyl)amino)methyl)phenoxy)-2-methylpropanoic acid | CHEMBL248118
Type:
Small organic molecule
Emp. Form.:
C27H28N2O5
Mol. Mass.:
460.5216
SMILES:
CC(C)(Oc1cccc(CN(CCCOc2ccccc2)c2nc3ccccc3o2)c1)C(O)=O
: