Target
Glutamate receptor ionotropic, NMDA 1
Ligand
BDBM50215279
Substrate
Meas. Tech.
ChEMBL_456499 (CHEMBL887322)
IC50
38±n/a nM
Citation
 Deur, CAgrawal, AKBaum, HBooth, JBove, SBrieland, JBunker, AConnolly, CCornicelli, JDumin, JFinzel, BGan, XGuppy, SKamilar, GKilgore, KLee, PLoi, CMLou, ZMorris, MPhilippe, LPrzybranowski, SRiley, FSamas, BSanchez, BTecle, HWang, ZWelch, KWilson, MYates, K N-(6,7-dichloro-2,3-dioxo-1,2,3,4-tetrahydroquinoxalin-5-yl)-N-alkylsulfonamides as peripherally restricted N-methyl-D-aspartate receptor antagonists for the treatment of pain. Bioorg Med Chem Lett 17:4599-603 (2007)  
Target
Name:
Glutamate receptor ionotropic, NMDA 1
Synonyms:
GRIN1 Glutamate [NMDA] receptor subunit zeta-1 N-methyl-D-aspartate receptor subunit NR1 NMDZ1_HUMAN | phencyclidine
Type:
Enzyme Catalytic Domain
Mol. Mass.:
105397.81
Organism:
Homo sapiens (Human)
Description:
Q05586
Residue:
938
  
Inhibitor
Name:
BDBM50215279
Synonyms:
CHEMBL248439 | N-(6,7-dichloro-2,3-dioxo-1,2,3,4-tetrahydroquinoxalin-5-yl)-N-(2-methoxyethyl)methanesulfonamide
Type:
Small organic molecule
Emp. Form.:
C12H13Cl2N3O5S
Mol. Mass.:
382.22
SMILES:
COCCN(c1c(Cl)c(Cl)cc2[nH]c(=O)c(=O)[nH]c12)S(C)(=O)=O
: