Target
P2Y purinoceptor 1
Ligand
BDBM50215404
Substrate
Meas. Tech.
ChEMBL_439405 (CHEMBL888518)
IC50
794±n/a nM
Citation
 Costanzi, STikhonova, IGOhno, MRoh, EJJoshi, BVColson, AOHouston, DMaddileti, SHarden, TKJacobson, KA P2Y1 antagonists: combining receptor-based modeling and QSAR for a quantitative prediction of the biological activity based on consensus scoring. J Med Chem 50:3229-41 (2007)  
Target
Name:
P2Y purinoceptor 1
Synonyms:
ATP receptor P2RY1_HUMAN P2Y1 Purinergic receptor P2Y1
Type:
Enzyme
Mol. Mass.:
42090.25
Organism:
Homo sapiens (Human)
Description:
P47900
Residue:
373
  
Inhibitor
Name:
BDBM50215404
Synonyms:
CHEMBL227235 | [3-(2-iodo-6-methylaminopurin-9-yl)-2-phosphonomethylpropyl]-phosphonic acid
Type:
Small organic molecule
Emp. Form.:
C10H16IN5O6P2
Mol. Mass.:
491.1159
SMILES:
CNc1nc(I)nc2n(CC(CP(O)(O)=O)CP(O)(O)=O)cnc12
: