Target
Prothrombin
Ligand
BDBM50215428
Substrate
Meas. Tech.
ChEMBL_439444 (CHEMBL888564)
IC50
>100000±n/a nM
Citation
 Trujillo, JIHuang, HCNeumann, WLMahoney, MWLong, SHuang, WGarland, DJKusturin, CAbbas, ZSouth, MSReitz, DB Design, synthesis, and biological evaluation of pyrazinones containing novel P1 needles as inhibitors of TF/VIIa. Bioorg Med Chem Lett 17:4568-74 (2007)  
Target
Name:
Prothrombin
Synonyms:
Activation peptide fragment 1 Coagulation factor II Prothrombin precursor Thrombin heavy chain | Thrombin light chain
Type:
Protein
Mol. Mass.:
70029.57
Organism:
Homo sapiens (Human)
Description:
P00734
Residue:
622
  
Inhibitor
Name:
BDBM50215428
Synonyms:
2-[6-(3-aminophenyl)-5-chloro-3-(cyclobutylamino)-2-oxo-1,2-dihydropyrazin-1-yl]-N-[(4-carbamimidoyl-2,3,5,6-tetrafluorophenyl)methyl]acetamide | CHEMBL230764
Type:
Small organic molecule
Emp. Form.:
C24H22ClF4N7O2
Mol. Mass.:
551.924
SMILES:
NC(=N)c1c(F)c(F)c(CNC(=O)Cn2c(c(Cl)nc(NC3CCC3)c2=O)-c2cccc(N)c2)c(F)c1F
: