Target
Coagulation factor VII
Ligand
BDBM50215432
Substrate
Meas. Tech.
ChEMBL_439443 (CHEMBL888563)
IC50
10700±n/a nM
Citation
 Trujillo, JIHuang, HCNeumann, WLMahoney, MWLong, SHuang, WGarland, DJKusturin, CAbbas, ZSouth, MSReitz, DB Design, synthesis, and biological evaluation of pyrazinones containing novel P1 needles as inhibitors of TF/VIIa. Bioorg Med Chem Lett 17:4568-74 (2007)  
Target
Name:
Coagulation factor VII
Synonyms:
Eptacog alfa FA7_HUMAN Factor VIIa (fVIIa) SPCA serum prothrombin conversion accelerator
Type:
Enzyme
Mol. Mass.:
51599.89
Organism:
Homo sapiens (Human)
Description:
Residue:
466
  
Inhibitor
Name:
BDBM50215432
Synonyms:
CHEMBL243317 | N-{2-[6-(3-aminophenyl)-5-chloro-3-(cyclobutylamino)-2-oxo-1,2-dihydropyrazin-1-yl]ethyl}-4-carbamimidoylbenzamide
Type:
Small organic molecule
Emp. Form.:
C24H26ClN7O2
Mol. Mass.:
479.962
SMILES:
NC(=N)c1ccc(cc1)C(=O)NCCn1c(c(Cl)nc(NC2CCC2)c1=O)-c1cccc(N)c1
: