Target
Metabotropic glutamate receptor 5
Ligand
BDBM50215554
Substrate
Meas. Tech.
ChEMBL_439646 (CHEMBL888761)
IC50
0.520000±n/a nM
Citation
 Siméon, FGBrown, AKZoghbi, SSPatterson, VMInnis, RBPike, VW Synthesis and simple 18F-labeling of 3-fluoro-5-(2-(2-(fluoromethyl)thiazol-4-yl)ethynyl)benzonitrile as a high affinity radioligand for imaging monkey brain metabotropic glutamate subtype-5 receptors with positron emission tomography. J Med Chem 50:3256-66 (2007)  
Target
Name:
Metabotropic glutamate receptor 5
Synonyms:
GRM5_RAT Grm5 Mglur5 metabotropic glutamate 5/1-C metabotropic glutamate 5a
Type:
Enzyme
Mol. Mass.:
131900.14
Organism:
Rattus norvegicus (Rat)
Description:
P31424
Residue:
1203
  
Inhibitor
Name:
BDBM50215554
Synonyms:
2-(fluoromethyl)4-(2-(3-methoxyphenyl)ethynyl)thiazole | CHEMBL229911
Type:
Small organic molecule
Emp. Form.:
C13H10FNOS
Mol. Mass.:
247.288
SMILES:
COc1cccc(c1)C#Cc1csc(CF)n1
: