Target
Metabotropic glutamate receptor 6
Ligand
BDBM50215552
Substrate
Meas. Tech.
ChEMBL_439663 (CHEMBL888778)
Ki
>10000±n/a nM
Citation
 Siméon, FGBrown, AKZoghbi, SSPatterson, VMInnis, RBPike, VW Synthesis and simple 18F-labeling of 3-fluoro-5-(2-(2-(fluoromethyl)thiazol-4-yl)ethynyl)benzonitrile as a high affinity radioligand for imaging monkey brain metabotropic glutamate subtype-5 receptors with positron emission tomography. J Med Chem 50:3256-66 (2007)  
Target
Name:
Metabotropic glutamate receptor 6
Synonyms:
GPRC1F GRM6_HUMAN Metabotropic glutamate receptor 6 metabotropic glutamate 6
Type:
Enzyme Catalytic Domain
Mol. Mass.:
95479.26
Organism:
Homo sapiens (Human)
Description:
metabotropic glutamate 6 GRM6 HUMAN::O15303
Residue:
877
  
Inhibitor
Name:
BDBM50215552
Synonyms:
3-fluoro-5-(2-(2-(fluoromethyl)thiazol-4-yl)ethynyl)benzonitrile | CHEMBL229429
Type:
Small organic molecule
Emp. Form.:
C13H6F2N2S
Mol. Mass.:
260.262
SMILES:
FCc1nc(cs1)C#Cc1cc(F)cc(c1)C#N
: