Target
Melanin-concentrating hormone receptor 1
Ligand
BDBM50164248
Substrate
Meas. Tech.
ChEMBL_437192 (CHEMBL906590)
Ki
9±n/a nM
Citation
 Su, JMcKittrick, BATang, HBurnett, DAClader, JWGreenlee, WJHawes, BEO'Neill, KSpar, BWeig, BKowalski, TSorota, SLi, CLiu, T SAR study of bicyclo[4.1.0]heptanes as melanin-concentrating hormone receptor R1 antagonists: taming hERG. Bioorg Med Chem 15:5369-85 (2007)  
Target
Name:
Melanin-concentrating hormone receptor 1
Synonyms:
G-protein coupled receptor 24 MCH receptor 1 MCH-R1 MCHR-1 MCHR1_HUMAN Melanin-Concentrating Hormone Receptor 1 (MCH1R) Melanin-concentrating hormone receptor 1 (MCH-1) Melanin-concentrating hormone receptor 1 (MCHR-1) SLC-1 Somatostatin receptor-like protein
Type:
G Protein-Coupled Receptor (GPCR)
Mol. Mass.:
45976.27
Organism:
Homo sapiens (Human)
Description:
Membranes from CHO-K1 cells stably expressing human MCH1R were used in assays.
Residue:
422
  
Inhibitor
Name:
BDBM50164248
Synonyms:
3-(3-Chloro-4-fluoro-phenyl)-1-[(3R,6S)-6-(3-cyano-phenyl)-bicyclo[4.1.0]hept-3-yl]-1-[2-((R)-3-hydroxy-pyrrolidin-1-yl)-ethyl]-urea CHEMBL193260
Type:
Small organic molecule
Emp. Form.:
C27H30ClFN4O2
Mol. Mass.:
497.004
SMILES:
O[C@@H]1CCN(CCN([C@@H]2CC[C@@]3(CC3C2)c2cccc(c2)C#N)C(=O)Nc2ccc(F)c(Cl)c2)C1
: