Target
Serine/threonine-protein kinase B-raf
Ligand
BDBM50215796
Substrate
Meas. Tech.
ChEMBL_456550 (CHEMBL922916)
IC50
349±n/a nM
Citation
 Wickens, PKluender, HDixon, JBrennan, CAchebe, FBacchiocchi, ABankston, DBierer, DBrands, MBraun, DBrown, MSChuang, CYDumas, JEnyedy, IHofilena, GHong, ZHousley, TJones, BKhire, UKreiman, CKumarasinghe, ELowinger, TOtt-Morgan, RPerkins, LPhillips, BSchoenleber, RScott, WJSheeler, RRedman, ASun, XTaylor, IWang, LWilhelm, SZhang, XZhang, MSullivan, ECarter, CMiglarese, MLevy, J SAR of a novel 'Anthranilamide Like' series of VEGFR-2, multi protein kinase inhibitors for the treatment of cancer. Bioorg Med Chem Lett 17:4378-81 (2007)  
Target
Name:
Serine/threonine-protein kinase B-raf
Synonyms:
B-RAF B-Raf proto-oncogene serine/threonine-protein kinase BRAF1 RAFB1 v-Raf murine sarcoma viral oncogene homolog B1
Type:
Serine/threonine-protein kinase
Mol. Mass.:
84446.00
Organism:
Homo sapiens (Human)
Description:
P15056
Residue:
766
  
Inhibitor
Name:
BDBM50215796
Synonyms:
CHEMBL400057 | N-(2,2-difluorobenzo[d][1,3]dioxol-5-yl)-2-((2-(dimethylamino)pyrimidin-4-yl)methylamino)benzamide
Type:
Small organic molecule
Emp. Form.:
C21H19F2N5O3
Mol. Mass.:
427.4041
SMILES:
CN(C)c1nccc(CNc2ccccc2C(=O)Nc2ccc3OC(F)(F)Oc3c2)n1
: