Target
Proteinase-activated receptor 1
Ligand
BDBM50215916
Substrate
Meas. Tech.
ChEMBL_447757 (CHEMBL896765)
IC50
440±n/a nM
Citation
 Xia, YChackalamannil, SClasby, MDoller, DEagen, KGreenlee, WJTsai, HAgans-Fantuzzi, JAhn, HSBoykow, GCHsieh, YLunn, CAChintala, M Himbacine derived thrombin receptor (PAR-1) antagonists: SAR of the pyridine ring. Bioorg Med Chem Lett 17:4509-13 (2007)  
Target
Name:
Proteinase-activated receptor 1
Synonyms:
CF2R F2R PAR1 Proteinase activated receptor 1 TR Thrombin receptor/ Proteinase-activated receptor 1(Par-1)
Type:
Protein
Mol. Mass.:
47450.07
Organism:
Homo sapiens (Human)
Description:
P25116
Residue:
425
  
Inhibitor
Name:
BDBM50215916
Synonyms:
(3R,3aS,4S,4aR,8aS,9aR,E)-3-methyl-4-(2-(5-morpholinopyridin-2-yl)vinyl)-decahydronaphtho[2,3-c]furan-1(3H)-one | CHEMBL231971
Type:
Small organic molecule
Emp. Form.:
C24H32N2O3
Mol. Mass.:
396.5225
SMILES:
C[C@H]1OC(=O)[C@@H]2C[C@@H]3CCCC[C@H]3[C@H](\C=C\c3ccc(cn3)N3CCOCC3)[C@H]12
: