Target
Matrilysin
Ligand
BDBM50216002
Substrate
Meas. Tech.
ChEMBL_456577 (CHEMBL922943)
Ki
>6368±n/a nM
Citation
 Gilmore, JLKing, BWAsakawa, NHarrison, KTebben, ASheppeck, JELiu, RQCovington, MDuan, JJ Synthesis and structure-activity relationship of a novel, non-hydroxamate series of TNF-alpha converting enzyme inhibitors. Bioorg Med Chem Lett 17:4678-82 (2007)  
Target
Name:
Matrilysin
Synonyms:
MMP7 MPSL1 Matrix metalloproteinase-7 (MMP-7) PUMP1
Type:
Enzyme
Mol. Mass.:
29681.54
Organism:
Homo sapiens (Human)
Description:
P09237
Residue:
267
  
Inhibitor
Name:
BDBM50216002
Synonyms:
CHEMBL247347 | cis-4-((2-methylquinolin-4-yl)methoxy)-N-(3-(5-thioxo-4,5-dihydro-1H-1,2,4-triazol-3-yl)-tetrahydro-2H-pyran-4-yl)benzamide
Type:
Small organic molecule
Emp. Form.:
C25H25N5O3S
Mol. Mass.:
475.563
SMILES:
Cc1cc(COc2ccc(cc2)C(=O)N[C@@H]2CCOC[C@@H]2c2n[nH]c(=S)[nH]2)c2ccccc2n1
: