Target
Macrophage metalloelastase
Ligand
BDBM50216007
Substrate
Meas. Tech.
ChEMBL_456578 (CHEMBL922944)
Ki
>6023±n/a nM
Citation
 Gilmore, JLKing, BWAsakawa, NHarrison, KTebben, ASheppeck, JELiu, RQCovington, MDuan, JJ Synthesis and structure-activity relationship of a novel, non-hydroxamate series of TNF-alpha converting enzyme inhibitors. Bioorg Med Chem Lett 17:4678-82 (2007)  
Target
Name:
Macrophage metalloelastase
Synonyms:
HME MMP12_HUMAN Matrix metalloproteinase-12 (MMP 12) Matrix metalloproteinase-12 (MMP12) | Matrix metalloproteinases 12 (MMP-12)
Type:
Enzyme
Mol. Mass.:
54012.99
Organism:
Homo sapiens (Human)
Description:
P39900
Residue:
470
  
Inhibitor
Name:
BDBM50216007
Synonyms:
CHEMBL393443 | tert-butyl 4-(4-((2-methylquinolin-4-yl)methoxy)benzamido)-4-((5-thioxo-4,5-dihydro-1H-1,2,4-triazol-3-yl)methyl)piperidine-1-carboxylate
Type:
Small organic molecule
Emp. Form.:
C31H36N6O4S
Mol. Mass.:
588.72
SMILES:
Cc1cc(COc2ccc(cc2)C(=O)NC2(Cc3n[nH]c(=S)[nH]3)CCN(CC2)C(=O)OC(C)(C)C)c2ccccc2n1
: