Target
Histone deacetylase 1
Ligand
BDBM50015184
Substrate
Meas. Tech.
ChEMBL_456584 (CHEMBL923961)
IC50
20000±n/a nM
Citation
 Witter, DJBelvedere, SChen, LSecrist, JPMosley, RTMiller, TA Benzo[b]thiophene-based histone deacetylase inhibitors. Bioorg Med Chem Lett 17:4562-7 (2007)  
Target
Name:
Histone deacetylase 1
Synonyms:
Cereblon/Histone deacetylase 1 HDAC1 Histone deacetylase 1 (HDAC1) RPD3L1
Type:
Enzyme
Mol. Mass.:
55090.27
Organism:
Homo sapiens (Human)
Description:
Q13547
Residue:
482
  
Inhibitor
Name:
BDBM50015184
Synonyms:
BENZHYDROXAMIC ACID CHEMBL16300 N-hydroxybenzamide | benzoyl hydroxamic acid
Type:
Small organic molecule
Emp. Form.:
C7H7NO2
Mol. Mass.:
137.136
SMILES:
ONC(=O)c1ccccc1
: