Target
Histone deacetylase 1
Ligand
BDBM50216015
Substrate
Meas. Tech.
ChEMBL_456584 (CHEMBL923961)
IC50
75±n/a nM
Citation
 Witter, DJBelvedere, SChen, LSecrist, JPMosley, RTMiller, TA Benzo[b]thiophene-based histone deacetylase inhibitors. Bioorg Med Chem Lett 17:4562-7 (2007)  
Target
Name:
Histone deacetylase 1
Synonyms:
Cereblon/Histone deacetylase 1 HDAC1 Histone deacetylase 1 (HDAC1) RPD3L1
Type:
Enzyme
Mol. Mass.:
55090.27
Organism:
Homo sapiens (Human)
Description:
Q13547
Residue:
482
  
Inhibitor
Name:
BDBM50216015
Synonyms:
5-(benzylamino)-N-hydroxybenzo[b]thiophene-2-carboxamide | CHEMBL394386
Type:
Small organic molecule
Emp. Form.:
C16H14N2O2S
Mol. Mass.:
298.36
SMILES:
ONC(=O)c1cc2cc(NCc3ccccc3)ccc2s1
: