Target
D(2) dopamine receptor
Ligand
BDBM50216046
Substrate
Meas. Tech.
ChEMBL_448363 (CHEMBL898624)
Ki
6.2±n/a nM
Citation
 Awadallah, FMMüller, FLehmann, JAbadi, AH Synthesis of novel lactam derivatives and their evaluation as ligands for the dopamine receptors, leading to a D(4)-selective ligand. Bioorg Med Chem 15:5811-8 (2007)  
Target
Name:
D(2) dopamine receptor
Synonyms:
D(2) dopamine receptor DOPAMINE D2 Long DRD2 Dopamine D2 receptor Dopamine D2 receptor (D2R) Dopamine2-like | d2
Type:
Cell-surface receptors
Mol. Mass.:
50647.10
Organism:
Homo sapiens (Human)
Description:
P14416
Residue:
443
  
Inhibitor
Name:
BDBM50216046
Synonyms:
2-(4-(4-phenyl-1-piperazinyl)butyl)-1,2-benzisothiazole-3(2H)-one 1,1-dioxide | CHEMBL238917
Type:
Small organic molecule
Emp. Form.:
C22H27N3O4S
Mol. Mass.:
429.532
SMILES:
COc1ccccc1N1CCN(CCCCN2C(=O)c3ccccc3S2(=O)=O)CC1
: