Target
D(2) dopamine receptor
Ligand
BDBM50216049
Substrate
Meas. Tech.
ChEMBL_448358 (CHEMBL898619)
Ki
323±n/a nM
Citation
 Awadallah, FMMüller, FLehmann, JAbadi, AH Synthesis of novel lactam derivatives and their evaluation as ligands for the dopamine receptors, leading to a D(4)-selective ligand. Bioorg Med Chem 15:5811-8 (2007)  
Target
Name:
D(2) dopamine receptor
Synonyms:
D(2) dopamine receptor DOPAMINE D2 Long DRD2 Dopamine D2 receptor Dopamine D2 receptor (D2R) Dopamine2-like | d2
Type:
Cell-surface receptors
Mol. Mass.:
50647.10
Organism:
Homo sapiens (Human)
Description:
P14416
Residue:
443
  
Inhibitor
Name:
BDBM50216049
Synonyms:
1-(4-(4-(3-a,a,a-trifluorotolyl)-1-piperazinyl)butyl)-indolin-2-one | CHEMBL268371
Type:
Small organic molecule
Emp. Form.:
C23H26F3N3O
Mol. Mass.:
417.4672
SMILES:
FC(F)(F)c1cccc(c1)N1CCN(CCCCN2C(=O)Cc3ccccc23)CC1
: