Target
Membrane-bound transcription factor site-1 protease
Ligand
BDBM50216182
Substrate
Meas. Tech.
ChEMBL_447771 (CHEMBL896780)
IC50
>16000±n/a nM
Citation
 Hay, BAAbrams, BZumbrunn, AYValentine, JJWarren, LCPetras, SFShelly, LDXia, AVarghese, AHHawkins, JLVan Camp, JARobbins, MDLandschulz, KHarwood, HJ Aminopyrrolidineamide inhibitors of site-1 protease. Bioorg Med Chem Lett 17:4411-4 (2007)  
Target
Name:
Membrane-bound transcription factor site-1 protease
Synonyms:
KIAA0091 MBTPS1 SKI1
Type:
PROTEIN
Mol. Mass.:
117773.36
Organism:
Homo sapiens (Human)
Description:
ChEMBL_641529
Residue:
1052
  
Inhibitor
Name:
BDBM50216182
Synonyms:
CHEMBL232778 | N-(2-ethoxyphenethyl)-4-((diethylamino)methyl)-N-(pyrrolidin-3-yl)benzamide
Type:
Small organic molecule
Emp. Form.:
C26H37N3O2
Mol. Mass.:
423.5909
SMILES:
CCOc1ccccc1CCN(C1CCNC1)C(=O)c1ccc(CN(CC)CC)cc1
: