Target
Glucocorticoid receptor
Ligand
BDBM50216480
Substrate
Meas. Tech.
ChEMBL_440116 (CHEMBL890428)
Ki
7.1±n/a nM
Citation
 Ray, NCClark, RDClark, DEWilliams, KHickin, HGCrackett, PHDyke, HJLockey, PMWong, MDevos, RWhite, ABelanoff, JK Discovery and optimization of novel, non-steroidal glucocorticoid receptor modulators. Bioorg Med Chem Lett 17:4901-5 (2007)  
Target
Name:
Glucocorticoid receptor
Synonyms:
GCR_HUMAN GRL Glucocorticoid receptor (GRFP) Nuclear receptor subfamily 3 group C member 1
Type:
Enzyme
Mol. Mass.:
85656.87
Organism:
Homo sapiens (Human)
Description:
P04150
Residue:
777
  
Inhibitor
Name:
BDBM50216480
Synonyms:
5-benzyl-6-(4-(2-methoxyphenyl)piperidin-1-yl)pyrimidine-2,4(1H,3H)-dione | CHEMBL231296
Type:
Small organic molecule
Emp. Form.:
C23H25N3O3
Mol. Mass.:
391.4629
SMILES:
COc1ccccc1C1CCN(CC1)c1[nH]c(=O)[nH]c(=O)c1Cc1ccccc1
: