Target
Kinesin-like protein KIF11
Ligand
BDBM50216507
Substrate
Meas. Tech.
ChEMBL_448481 (CHEMBL897635)
IC50
3000±n/a nM
Citation
 Klein, EDeBonis, SThiede, BSkoufias, DAKozielski, FLebeau, L New chemical tools for investigating human mitotic kinesin Eg5. Bioorg Med Chem 15:6474-88 (2007)  
Target
Name:
Kinesin-like protein KIF11
Synonyms:
EG5 KIF11_HUMAN Kinesin Spindle Protein Eg5 TRIP5 | kinesin spindle protein
Type:
PROTEIN
Mol. Mass.:
119138.97
Organism:
Homo sapiens (Human)
Description:
ChEMBL_1457426
Residue:
1056
  
Inhibitor
Name:
BDBM50216507
Synonyms:
5-furanoyl-4-(3-hydroxy-phenyl)-6-methyl-2-thioxo-1,2,3,4-tetrahydro-pyrimidine | CHEMBL240471
Type:
Small organic molecule
Emp. Form.:
C16H14N2O3S
Mol. Mass.:
314.359
SMILES:
CC1=NC(=S)NC(C1C(=O)c1ccco1)c1cccc(O)c1
: