Target
Sodium channel protein type 9 subunit alpha
Ligand
BDBM50216652
Substrate
Meas. Tech.
ChEMBL_456687 (CHEMBL924068)
IC50
>1000±n/a nM
Citation
 Hoyt, SBLondon, CGorin, DWyvratt, MJFisher, MHAbbadie, CFelix, JPGarcia, MLLi, XLyons, KAMcGowan, EMacIntyre, DEMartin, WJPriest, BTRitter, ASmith, MMWarren, VAWilliams, BSKaczorowski, GJParsons, WH Discovery of a novel class of benzazepinone Na(v)1.7 blockers: potential treatments for neuropathic pain. Bioorg Med Chem Lett 17:4630-4 (2007)  
Target
Name:
Sodium channel protein type 9 subunit alpha
Synonyms:
NENA Peripheral sodium channel 1 SCN9A_HUMAN Voltage-gated sodium channel subunit Nav1.7 hNE-Na
Type:
Protein
Mol. Mass.:
226375.97
Organism:
Homo sapiens (Human)
Description:
Q15858
Residue:
1988
  
Inhibitor
Name:
BDBM50216652
Synonyms:
CHEMBL247656 | tert-butyl (R)-1-((R)-1-methyl-2-oxo-5-phenyl-2,3-dihydro-1H-benzo[e][1,4]diazepin-3-ylamino)-1-oxopropan-2-ylcarbamate
Type:
Small organic molecule
Emp. Form.:
C24H28N4O4
Mol. Mass.:
436.5035
SMILES:
C[C@@H](NC(=O)OC(C)(C)C)C(=O)N[C@@H]1N=C(c2ccccc2)c2ccccc2N(C)C1=O
: