Target
Sodium channel protein type 9 subunit alpha
Ligand
BDBM50216670
Substrate
Meas. Tech.
ChEMBL_456687 (CHEMBL924068)
IC50
150±n/a nM
Citation
 Hoyt, SBLondon, CGorin, DWyvratt, MJFisher, MHAbbadie, CFelix, JPGarcia, MLLi, XLyons, KAMcGowan, EMacIntyre, DEMartin, WJPriest, BTRitter, ASmith, MMWarren, VAWilliams, BSKaczorowski, GJParsons, WH Discovery of a novel class of benzazepinone Na(v)1.7 blockers: potential treatments for neuropathic pain. Bioorg Med Chem Lett 17:4630-4 (2007)  
Target
Name:
Sodium channel protein type 9 subunit alpha
Synonyms:
NENA Peripheral sodium channel 1 SCN9A_HUMAN Voltage-gated sodium channel subunit Nav1.7 hNE-Na
Type:
Protein
Mol. Mass.:
226375.97
Organism:
Homo sapiens (Human)
Description:
Q15858
Residue:
1988
  
Inhibitor
Name:
BDBM50216670
Synonyms:
CHEMBL394058 | benzyl (R)-1-((R)-1-methyl-2-oxo-5-phenyl-2,3-dihydro-1H-benzo[e][1,4]diazepin-3-ylamino)-1-oxo-3-phenylpropan-2-ylcarbamate
Type:
Small organic molecule
Emp. Form.:
C33H30N4O4
Mol. Mass.:
546.6157
SMILES:
CN1c2ccccc2C(=N[C@@H](NC(=O)[C@@H](Cc2ccccc2)NC(=O)OCc2ccccc2)C1=O)c1ccccc1
: