Target
Protein-glutamine gamma-glutamyltransferase 2
Ligand
BDBM50216777
Substrate
Meas. Tech.
ChEMBL_456762 (CHEMBL924143)
Ki
200000±n/a nM
Citation
 Siegel, MXia, JKhosla, C Structure-based design of alpha-amido aldehyde containing gluten peptide analogues as modulators of HLA-DQ2 and transglutaminase 2. Bioorg Med Chem 15:6253-61 (2007)  
Target
Name:
Protein-glutamine gamma-glutamyltransferase 2
Synonyms:
Protein-glutamine gamma-glutamyltransferase TGM2 Tissue transglutaminase Transglutaminase 2 (TGM2) Transglutaminase-2
Type:
Protein
Mol. Mass.:
77309.30
Organism:
Homo sapiens (Human)
Description:
P21980
Residue:
687
  
Inhibitor
Name:
BDBM50216777
Synonyms:
(2S)-2-{[(2S)-1-[(2S)-2-[(2S)-2-{[(2S)-1-[(2S)-4-carbamoyl-2-[(2S)-pyrrolidin-2-ylformamido]butanoyl]pyrrolidin-2-yl]formamido}-5-(2-oxoacetamido)pentanamido]-4-methylpentanoyl]pyrrolidin-2-yl]formamido}-3-phenylpropanoic acid | CHEMBL397328
Type:
Small organic molecule
Emp. Form.:
C42H61N9O11
Mol. Mass.:
867.9874
SMILES:
CC(C)C[C@H](NC(=O)[C@H](CCCNC(=O)C=O)NC(=O)[C@@H]1CCCN1C(=O)[C@H](CCC(N)=O)NC(=O)[C@@H]1CCCN1)C(=O)N1CCC[C@H]1C(=O)N[C@@H](Cc1ccccc1)C(O)=O
: