Target
Protein kinase C alpha type
Ligand
BDBM50216860
Substrate
Meas. Tech.
ChEMBL_440175 (CHEMBL890489)
Ki
3.07±n/a nM
Citation
 Choi, YPu, YPeach, MLKang, JHLewin, NESigano, DMGarfield, SHBlumberg, PMMarquez, VE Conformationally constrained analogues of diacylglycerol (DAG). 28. DAG-dioxolanones reveal a new additional interaction site in the C1b domain of PKC delta. J Med Chem 50:3465-81 (2007)  
Target
Name:
Protein kinase C alpha type
Synonyms:
KPCA_MOUSE Prkca Protein kinase C alpha | Protein kinase C alpha type
Type:
Enzyme Catalytic Domain
Mol. Mass.:
76858.67
Organism:
MOUSE
Description:
Protein kinase C 0 MOUSE::P20444
Residue:
672
  
Inhibitor
Name:
BDBM50216860
Synonyms:
CHEMBL230048 | Z-[2-(Hydroxymethyl)-4-(3-methylbutylidene)-5-oxo-2-(2,3-dihydrofuryl)]methyl 5-Methyl-3-(2-methylpropyl)hexanoate
Type:
Small organic molecule
Emp. Form.:
C22H38O5
Mol. Mass.:
382.5341
SMILES:
CC(C)C\C=C1\CC(CO)(COC(=O)CC(CC(C)C)CC(C)C)OC1=O
: