Target
11-beta-hydroxysteroid dehydrogenase 1
Ligand
BDBM50216922
Substrate
Meas. Tech.
ChEMBL_448530 (CHEMBL897679)
Ki
46±n/a nM
Citation
 Sutin, LAndersson, SBergquist, LCastro, VMDanielsson, EJames, SHenriksson, MJohansson, LKaiser, CFlyrén, KWilliams, M Oxazolones as potent inhibitors of 11beta-hydroxysteroid dehydrogenase type 1. Bioorg Med Chem Lett 17:4837-40 (2007)  
Target
Name:
11-beta-hydroxysteroid dehydrogenase 1
Synonyms:
11-DH 11-beta-Hydroxysteroid Dehydrogenase 1 (11-beta-HSD1) 11-beta-hydroxysteroid dehydrogenase 1 (11HSD1) Corticosteroid 11-beta-dehydrogenase isozyme 1 (11-beta-HSD-1) Corticosteroid 11-beta-dehydrogenase isozyme 1 (11beta-HSD1) HSD11 HSD11L | SDR26C1
Type:
Enzyme
Mol. Mass.:
32409.16
Organism:
Homo sapiens (Human)
Description:
P28845
Residue:
292
  
Inhibitor
Name:
BDBM50216922
Synonyms:
5-isopropyl-5-methyl-2-[(S)-1-(2-trifluoromethyl-phenyl)-ethylamino]-oxazol-4-one | CHEMBL237107
Type:
Small organic molecule
Emp. Form.:
C16H19F3N2O2
Mol. Mass.:
328.3295
SMILES:
CC(C)C1(C)OC(N[C@@H](C)c2ccccc2C(F)(F)F)=NC1=O
: