Target
11-beta-hydroxysteroid dehydrogenase 1
Ligand
BDBM50216915
Substrate
Meas. Tech.
ChEMBL_448530 (CHEMBL897679)
Ki
7±n/a nM
Citation
 Sutin, LAndersson, SBergquist, LCastro, VMDanielsson, EJames, SHenriksson, MJohansson, LKaiser, CFlyrén, KWilliams, M Oxazolones as potent inhibitors of 11beta-hydroxysteroid dehydrogenase type 1. Bioorg Med Chem Lett 17:4837-40 (2007)  
Target
Name:
11-beta-hydroxysteroid dehydrogenase 1
Synonyms:
11-DH 11-beta-Hydroxysteroid Dehydrogenase 1 (11-beta-HSD1) 11-beta-hydroxysteroid dehydrogenase 1 (11HSD1) Corticosteroid 11-beta-dehydrogenase isozyme 1 (11-beta-HSD-1) Corticosteroid 11-beta-dehydrogenase isozyme 1 (11beta-HSD1) HSD11 HSD11L | SDR26C1
Type:
Enzyme
Mol. Mass.:
32409.16
Organism:
Homo sapiens (Human)
Description:
P28845
Residue:
292
  
Inhibitor
Name:
BDBM50216915
Synonyms:
2-(2-adamantylamino)-5-methyl-5-(trifluoromethyl)-1,3-oxazol-4(5H)-one | CHEMBL237798
Type:
Small organic molecule
Emp. Form.:
C15H19F3N2O2
Mol. Mass.:
316.3188
SMILES:
CC1(OC(NC2C3CC4CC(C3)CC2C4)=NC1=O)C(F)(F)F
: