Target
Histone deacetylase 3
Ligand
BDBM50241188
Substrate
Meas. Tech.
ChEMBL_440469 (CHEMBL890785)
IC50
3162.28±n/a nM
Citation
 Dehmel, FCiossek, TMaier, TWeinbrenner, SSchmidt, BZoche, MBeckers, T Trithiocarbonates: exploration of a new head group for HDAC inhibitors. Bioorg Med Chem Lett 17:4746-52 (2007)  
Target
Name:
Histone deacetylase 3
Synonyms:
HD3 HDAC3_HUMAN Human HDAC3 SMAP45
Type:
Enzyme
Mol. Mass.:
48829.55
Organism:
Homo sapiens (Human)
Description:
O15379
Residue:
428
  
Inhibitor
Name:
BDBM50241188
Synonyms:
CHEMBL242039 trithiocarbonic acid ethyl ester 2-(4-methoxy-phenyl)-2-oxo-ethyl ester
Type:
Small organic molecule
Emp. Form.:
C12H14O2S3
Mol. Mass.:
286.433
SMILES:
CCSC(=S)SCC(=O)c1ccc(OC)cc1
: