Target
Calcitonin gene-related peptide type 1 receptor/Receptor activity-modifying protein 1
Ligand
BDBM50217485
Substrate
Meas. Tech.
ChEMBL_448633 (CHEMBL897783)
Ki
29±n/a nM
Citation
 Shaw, AWPaone, DVNguyen, DNStump, CABurgey, CSMosser, SDSalvatore, CARutledge, RZKane, SAKoblan, KSGraham, SLVacca, JPWilliams, TM Caprolactams as potent CGRP receptor antagonists for the treatment of migraine. Bioorg Med Chem Lett 17:4795-8 (2007)  
Target
Name:
Calcitonin gene-related peptide type 1 receptor/Receptor activity-modifying protein 1
Synonyms:
Calcitonin-gene-related peptide receptor, CALCRL/RAMP1
Type:
Mol. Mass.:
Description:
ASSAY_ID of EBI is 327200
Components:
This complex has 2 components.
Component 1
Name:
Calcitonin gene-related peptide type 1 receptor
Synonyms:
Adrenomedullin receptor AM1; CALCRL/RAMP2 CALRL_HUMAN CGRP type 1 receptor mRNA Calcitonin gene-related peptide (CGRP) receptor Calcitonin receptor-like receptor Human CL receptor
Type:
Enzyme Catalytic Domain
Mol. Mass.:
52980.45
Organism:
Homo sapiens (Human)
Description:
Q16602
Residue:
461
  
Component 2
Name:
Receptor activity-modifying protein 1
Synonyms:
Calcitonin-gene-related peptide receptor, CALCRL/RAMP1 RAMP1_HUMAN
Type:
PROTEIN
Mol. Mass.:
16992.80
Organism:
Homo sapiens (Human)
Description:
EBI_100673
Residue:
148
  
Inhibitor
Name:
BDBM50217485
Synonyms:
CHEMBL394229 | N-((3R,6S)-1-(cyclopropylmethyl)-2-oxo-6-phenylazepan-3-yl)-4-(2-oxo-1,2,4,5-tetrahydrobenzo[d][1,3]diazepin-3-yl)piperidine-1-carboxamide
Type:
Small organic molecule
Emp. Form.:
C31H39N5O3
Mol. Mass.:
529.6731
SMILES:
O=C(N[C@@H]1CC[C@H](CN(CC2CC2)C1=O)c1ccccc1)N1CCC(CC1)N1CCc2ccccc2NC1=O
: