Target
Melanocyte-stimulating hormone receptor
Ligand
BDBM50217634
Substrate
Meas. Tech.
ChEMBL_448689 (CHEMBL896689)
Ki
1900±n/a nM
Citation
 Mutulis, FKreicberga, JYahorava, SMutule, IBorisova-Jan, LYahorau, AMuceniece, RAzena, SVeiksina, SPetrovska, RWikberg, JE Design and synthesis of a library of tertiary amides: evaluation as mimetics of the melanocortins' active core. Bioorg Med Chem 15:5787-810 (2007)  
Target
Name:
Melanocyte-stimulating hormone receptor
Synonyms:
MC1-R Mc1r Melanocyte-stimulating hormone receptor | Msh-r
Type:
PROTEIN
Mol. Mass.:
35238.60
Organism:
Mus musculus
Description:
ChEMBL_1498846
Residue:
315
  
Inhibitor
Name:
BDBM50217634
Synonyms:
(Z)-N-(4-((4-aminocyclohexyl)methyl)cyclohexyl)-N-(2-chloro-3-phenylallyl)-2-(naphthalen-2-yloxy)acetamide | CHEMBL237702
Type:
Small organic molecule
Emp. Form.:
C34H41ClN2O2
Mol. Mass.:
545.155
SMILES:
NC1CCC(CC2CCC(CC2)N(C\C(Cl)=C\c2ccccc2)C(=O)COc2ccc3ccccc3c2)CC1
: