Target
Melanocyte-stimulating hormone receptor
Ligand
BDBM50217757
Substrate
Meas. Tech.
ChEMBL_448689 (CHEMBL896689)
Ki
1500±n/a nM
Citation
 Mutulis, FKreicberga, JYahorava, SMutule, IBorisova-Jan, LYahorau, AMuceniece, RAzena, SVeiksina, SPetrovska, RWikberg, JE Design and synthesis of a library of tertiary amides: evaluation as mimetics of the melanocortins' active core. Bioorg Med Chem 15:5787-810 (2007)  
Target
Name:
Melanocyte-stimulating hormone receptor
Synonyms:
MC1-R Mc1r Melanocyte-stimulating hormone receptor | Msh-r
Type:
PROTEIN
Mol. Mass.:
35238.60
Organism:
Mus musculus
Description:
ChEMBL_1498846
Residue:
315
  
Inhibitor
Name:
BDBM50217757
Synonyms:
CHEMBL393350 | N-benzyl-N-[4-(4-guanidino-cyclohexylmethyl)-cyclohexyl]-4-(1H-indol-3-yl)-butyramide
Type:
Small organic molecule
Emp. Form.:
C33H45N5O
Mol. Mass.:
527.7433
SMILES:
NC(N)=NC1CCC(CC2CCC(CC2)N(Cc2ccccc2)C(=O)CCCc2c[nH]c3ccccc23)CC1
: