Target
Melanocyte-stimulating hormone receptor
Ligand
BDBM50217705
Substrate
Meas. Tech.
ChEMBL_448689 (CHEMBL896689)
Ki
1400±n/a nM
Citation
 Mutulis, FKreicberga, JYahorava, SMutule, IBorisova-Jan, LYahorau, AMuceniece, RAzena, SVeiksina, SPetrovska, RWikberg, JE Design and synthesis of a library of tertiary amides: evaluation as mimetics of the melanocortins' active core. Bioorg Med Chem 15:5787-810 (2007)  
Target
Name:
Melanocyte-stimulating hormone receptor
Synonyms:
MC1-R Mc1r Melanocyte-stimulating hormone receptor | Msh-r
Type:
PROTEIN
Mol. Mass.:
35238.60
Organism:
Mus musculus
Description:
ChEMBL_1498846
Residue:
315
  
Inhibitor
Name:
BDBM50217705
Synonyms:
CHEMBL237689 | N-(4-cyanobenzyl)-4-(2-(4-hydroxybenzyl)-1H-indol-3-yl)-N-(4-((4-aminocyclohexyl)methyl)cyclohexyl)butanamide
Type:
Small organic molecule
Emp. Form.:
C40H48N4O2
Mol. Mass.:
616.8347
SMILES:
NC1CCC(CC2CCC(CC2)N(Cc2ccc(cc2)C#N)C(=O)CCCc2c(Cc3ccc(O)cc3)[nH]c3ccccc23)CC1
: