Target
Melanocyte-stimulating hormone receptor
Ligand
BDBM50217768
Substrate
Meas. Tech.
ChEMBL_448689 (CHEMBL896689)
Ki
4800±n/a nM
Citation
 Mutulis, FKreicberga, JYahorava, SMutule, IBorisova-Jan, LYahorau, AMuceniece, RAzena, SVeiksina, SPetrovska, RWikberg, JE Design and synthesis of a library of tertiary amides: evaluation as mimetics of the melanocortins' active core. Bioorg Med Chem 15:5787-810 (2007)  
Target
Name:
Melanocyte-stimulating hormone receptor
Synonyms:
MC1-R Mc1r Melanocyte-stimulating hormone receptor | Msh-r
Type:
PROTEIN
Mol. Mass.:
35238.60
Organism:
Mus musculus
Description:
ChEMBL_1498846
Residue:
315
  
Inhibitor
Name:
BDBM50217768
Synonyms:
CHEMBL238180 | N-(3-aminopropyl)-N-(1,2,3,4-tetrahydronaphthalen-2-yl)-1H-indole-3-carboxamide
Type:
Small organic molecule
Emp. Form.:
C22H25N3O
Mol. Mass.:
347.4534
SMILES:
NCCCN(C1CCc2ccccc2C1)C(=O)c1c[nH]c2ccccc12
: