Target
Melanocortin receptor 4
Ligand
BDBM50217734
Substrate
Meas. Tech.
ChEMBL_448693 (CHEMBL897839)
Ki
16000±n/a nM
Citation
 Mutulis, FKreicberga, JYahorava, SMutule, IBorisova-Jan, LYahorau, AMuceniece, RAzena, SVeiksina, SPetrovska, RWikberg, JE Design and synthesis of a library of tertiary amides: evaluation as mimetics of the melanocortins' active core. Bioorg Med Chem 15:5787-810 (2007)  
Target
Name:
Melanocortin receptor 4
Synonyms:
MC4-R MC4R_HUMAN Melanocortin receptor 4 (MC-4) Melanocortin receptor 4 (MC4R)
Type:
Enzyme
Mol. Mass.:
36949.50
Organism:
Homo sapiens (Human)
Description:
P32245
Residue:
332
  
Inhibitor
Name:
BDBM50217734
Synonyms:
CHEMBL237693 | N-(5-aminopentyl)-N-cycloheptyl-2-(1H-indol-3-yl)acetamide
Type:
Small organic molecule
Emp. Form.:
C22H33N3O
Mol. Mass.:
355.5169
SMILES:
NCCCCCN(C1CCCCCC1)C(=O)Cc1c[nH]c2ccccc12
: