Target
Melanocortin receptor 5
Ligand
BDBM50217770
Substrate
Meas. Tech.
ChEMBL_448695 (CHEMBL897841)
Ki
49000±n/a nM
Citation
 Mutulis, FKreicberga, JYahorava, SMutule, IBorisova-Jan, LYahorau, AMuceniece, RAzena, SVeiksina, SPetrovska, RWikberg, JE Design and synthesis of a library of tertiary amides: evaluation as mimetics of the melanocortins' active core. Bioorg Med Chem 15:5787-810 (2007)  
Target
Name:
Melanocortin receptor 5
Synonyms:
MC-2 MC5R Melanocortin MC5 Melanocortin receptor 5 | Melanocortin receptor 5 (MC5R)
Type:
Enzyme
Mol. Mass.:
36612.92
Organism:
Homo sapiens (Human)
Description:
P33032
Residue:
325
  
Inhibitor
Name:
BDBM50217770
Synonyms:
CHEMBL393753 | N-(4-((4-aminocyclohexyl)methyl)cyclohexyl)-4-(1H-indol-3-yl)-N-(pyridin-2-ylmethyl)butanamide
Type:
Small organic molecule
Emp. Form.:
C31H42N4O
Mol. Mass.:
486.6914
SMILES:
NC1CCC(CC2CCC(CC2)N(Cc2ccccn2)C(=O)CCCc2c[nH]c3ccccc23)CC1
: