Target
Melanocortin receptor 5
Ligand
BDBM50217777
Substrate
Meas. Tech.
ChEMBL_448695 (CHEMBL897841)
Ki
29000±n/a nM
Citation
 Mutulis, FKreicberga, JYahorava, SMutule, IBorisova-Jan, LYahorau, AMuceniece, RAzena, SVeiksina, SPetrovska, RWikberg, JE Design and synthesis of a library of tertiary amides: evaluation as mimetics of the melanocortins' active core. Bioorg Med Chem 15:5787-810 (2007)  
Target
Name:
Melanocortin receptor 5
Synonyms:
MC-2 MC5R Melanocortin MC5 Melanocortin receptor 5 | Melanocortin receptor 5 (MC5R)
Type:
Enzyme
Mol. Mass.:
36612.92
Organism:
Homo sapiens (Human)
Description:
P33032
Residue:
325
  
Inhibitor
Name:
BDBM50217777
Synonyms:
CHEMBL237079 | N-(2-aminoethyl)-2-(1H-indol-3-yl)-N-(1,2,3,4-tetrahydronaphthalen-2-yl)acetamide
Type:
Small organic molecule
Emp. Form.:
C22H25N3O
Mol. Mass.:
347.4534
SMILES:
NCCN(C1CCc2ccccc2C1)C(=O)Cc1c[nH]c2ccccc12
: