Target
Melanocortin receptor 5
Ligand
BDBM50217710
Substrate
Meas. Tech.
ChEMBL_448695 (CHEMBL897841)
Ki
25000±n/a nM
Citation
 Mutulis, FKreicberga, JYahorava, SMutule, IBorisova-Jan, LYahorau, AMuceniece, RAzena, SVeiksina, SPetrovska, RWikberg, JE Design and synthesis of a library of tertiary amides: evaluation as mimetics of the melanocortins' active core. Bioorg Med Chem 15:5787-810 (2007)  
Target
Name:
Melanocortin receptor 5
Synonyms:
MC-2 MC5R Melanocortin MC5 Melanocortin receptor 5 | Melanocortin receptor 5 (MC5R)
Type:
Enzyme
Mol. Mass.:
36612.92
Organism:
Homo sapiens (Human)
Description:
P33032
Residue:
325
  
Inhibitor
Name:
BDBM50217710
Synonyms:
CHEMBL396341 | N-(3-aminopropyl)-N-benzyl-4-(1H-indol-3-yl)butanamide
Type:
Small organic molecule
Emp. Form.:
C22H27N3O
Mol. Mass.:
349.4693
SMILES:
NCCCN(Cc1ccccc1)C(=O)CCCc1c[nH]c2ccccc12
: