Target
Serine/threonine-protein kinase Chk1
Ligand
BDBM50218724
Substrate
Meas. Tech.
ChEMBL_444965 (CHEMBL894121)
IC50
53±n/a nM
Citation
 Wang, LSullivan, GMHexamer, LAHasvold, LAThalji, RPrzytulinska, MTao, ZFLi, GChen, ZXiao, ZGu, WZXue, JBui, MHMerta, PKovar, PBouska, JJZhang, HPark, CStewart, KDSham, HLSowin, TJRosenberg, SHLin, NH Design, synthesis, and biological activity of 5,10-dihydro-dibenzo[b,e][1,4]diazepin-11-one-based potent and selective Chk-1 inhibitors. J Med Chem 50:4162-76 (2007)  
Target
Name:
Serine/threonine-protein kinase Chk1
Synonyms:
CHEK1 CHK1 checkpoint homolog Checkpoint kinase-1 (CHK1)
Type:
Enzyme Catalytic Domain
Mol. Mass.:
54443.02
Organism:
Homo sapiens (Human)
Description:
gi_166295192
Residue:
476
  
Inhibitor
Name:
BDBM50218724
Synonyms:
CHEMBL395277 | methyl 2-methoxy-4-(11-oxo-10,11-dihydro-5H-dibenzo[b,e]-[1,4]diazepin-3-yl)benzoate
Type:
Small organic molecule
Emp. Form.:
C22H18N2O4
Mol. Mass.:
374.3893
SMILES:
COC(=O)c1ccc(cc1OC)-c1ccc2c(Nc3ccccc3NC2=O)c1
: