Target
Cannabinoid receptor 1
Ligand
BDBM50219076
Substrate
Meas. Tech.
ChEMBL_445329 (CHEMBL894469)
Ki
0.48±n/a nM
Citation
 Papahatjis, DPNahmias, VRNikas, SPAndreou, TAlapafuja, SOTsotinis, AGuo, JFan, PMakriyannis, A C1'-cycloalkyl side chain pharmacophore in tetrahydrocannabinols. J Med Chem 50:4048-60 (2007)  
Target
Name:
Cannabinoid receptor 1
Synonyms:
Brain-type cannabinoid receptor CB-R CNR1_RAT Cannabinoid receptor Cnr1 | Skr6
Type:
G Protein-Coupled Receptor (GPCR)
Mol. Mass.:
52856.55
Organism:
Rattus norvegicus (rat)
Description:
P20272
Residue:
473
  
Inhibitor
Name:
BDBM50219076
Synonyms:
(6aR-trans)-3-(1-heptylcyclopropyl)-6a,7,10,10a-tetrahydro-6,6,9-trimethyl-6H-dibenzo[b,d]pyran-1-ol | CHEMBL231368
Type:
Small organic molecule
Emp. Form.:
C26H38O2
Mol. Mass.:
382.5787
SMILES:
CCCCCCCC1(CC1)c1cc(O)c2[C@@H]3CC(C)=CC[C@H]3C(C)(C)Oc2c1
: