Target
D(1B) dopamine receptor
Ligand
BDBM50180913
Substrate
Meas. Tech.
ChEMBL_445435 (CHEMBL895727)
Ki
1.5±n/a nM
Citation
 Enzensperger, CMüller, FKSchmalwasser, BWiecha, PTraber, HLehmann, J Dopamine/serotonin receptor ligands. 16.(1) Expanding dibenz[d,g]azecines to 11- and 12-membered homologues. Interaction with dopamine D(1)-D(5) receptors. J Med Chem 50:4528-33 (2007)  
Target
Name:
D(1B) dopamine receptor
Synonyms:
D(5) dopamine receptor DOPAMINE D5 DRD1L2 DRD5_HUMAN | dopamine receptor D5
Type:
Protein
Mol. Mass.:
52943.41
Organism:
Homo sapiens (Human)
Description:
P21918
Residue:
477
  
Inhibitor
Name:
BDBM50180913
Synonyms:
11-methyl-11-aza-tricyclo[12.4.0.0.3,8]octadeca-1(18),3(8),4,6,14,16-hexaen-6-ol 3-hydroxy-7-methyl-5,6,7,8,9,14-hexahydrodibenzo[d,g]azecine CHEMBL1204122 LE404
Type:
Small organic molecule
Emp. Form.:
C18H21NO
Mol. Mass.:
267.3654
SMILES:
CN1CCc2ccccc2Cc2ccc(O)cc2CC1
: