Target
Cholinesterase
Ligand
BDBM50219213
Substrate
Meas. Tech.
ChEMBL_448898 (CHEMBL898044)
Ki
820±n/a nM
Citation
 Darvesh, SMcDonald, RSDarvesh, KVMataija, DConrad, SGomez, GWalsh, RMartin, E Selective reversible inhibition of human butyrylcholinesterase by aryl amide derivatives of phenothiazine. Bioorg Med Chem 15:6367-78 (2007)  
Target
Name:
Cholinesterase
Synonyms:
Acylcholine acylhydrolase Butyrylcholine esterase (BChE) Butyrylcholinesterase (BuChE) CHLE_HUMAN Cholinesterases Pseudocholinesterase
Type:
Homotetramer
Mol. Mass.:
68422.27
Organism:
Homo sapiens (Human)
Description:
P06276
Residue:
602
  
Inhibitor
Name:
BDBM50219213
Synonyms:
(4-nitrophenyl)(10H-phenothiazin-10-yl)methanone | CHEMBL239834
Type:
Small organic molecule
Emp. Form.:
C19H12N2O3S
Mol. Mass.:
348.375
SMILES:
[O-][N+](=O)c1ccc(cc1)C(=O)N1c2ccccc2Sc2ccccc12
: