Target
Androgen receptor
Ligand
BDBM50219549
Substrate
Meas. Tech.
ChEMBL_457219 (CHEMBL940820)
EC50
190±n/a nM
Citation
 Higuchi, RIThompson, AWChen, JHCaferro, TRCummings, MLDeckhut, CPAdams, METegley, CMEdwards, JPLópez, FJKallel, EAKaranewsky, DSSchrader, WTMarschke, KBZhi, L Potent, nonsteroidal selective androgen receptor modulators (SARMs) based on 8H-[1,4]oxazino[2,3-f]quinolin-8-ones. Bioorg Med Chem Lett 17:5442-6 (2007)  
Target
Name:
Androgen receptor
Synonyms:
ANDR_HUMAN Androgen Receptor Androgen receptor/Baculoviral IAP repeat-containing protein 2 Dihydrotestosterone receptor Nuclear receptor subfamily 3 group C member 4
Type:
Receptor
Mol. Mass.:
99185.27
Organism:
Homo sapiens (Human)
Description:
CHO cells were stably transfected with human AR gene.
Residue:
920
  
Inhibitor
Name:
BDBM50219549
Synonyms:
4-(2,2,2-trifluoroethyl)-10-(trifluoromethyl)-3,4-dihydro-2H-[1,4]oxazino[2,3-f]quinolin-8(7H)-one | CHEMBL250496
Type:
Small organic molecule
Emp. Form.:
C14H10F6N2O2
Mol. Mass.:
352.2318
SMILES:
FC(F)(F)CN1CCOc2c1ccc1[nH]c(=O)cc(c21)C(F)(F)F
: